hi,

i tried the package from https://www.suse.com/communities/con...or-sled-11-sp3

i have the SDK SP3 repo, packman repo. checkdependencies gives me all green (of course i installed with zypper the required packages according to the README).

when running build script, i get this error:
make[3]: Leaving directory `/tmp/tmp.4q2vNRTlPr/gst/coloreffects'
make -C colorspace
make[3]: Entering directory `/tmp/tmp.4q2vNRTlPr/gst/colorspace'
ORCC tmp-orc.c
Feature used that is incompatible with --compat in program cogorc_memcpy_2d
make[3]: *** [tmp-orc.c] Error 1
make[3]: Leaving directory `/tmp/tmp.4q2vNRTlPr/gst/colorspace'
make[2]: *** [colorspace] Error 2
make[2]: *** Waiting for unfinished jobs....
make[4]: Leaving directory `/tmp/tmp.4q2vNRTlPr/gst/camerabin'
make[3]: Leaving directory `/tmp/tmp.4q2vNRTlPr/gst/camerabin'
make[2]: Leaving directory `/tmp/tmp.4q2vNRTlPr/gst'
make[1]: *** [all-recursive] Error 1
make[1]: Leaving directory `/tmp/tmp.4q2vNRTlPr'
make: *** [all] Error 2

Anyone has an idea for how to fix it?

thanks.