# vmware player 5 kernel module

**URL:** <https://forums.suse.com/t/vmware-player-5-kernel-module/26216>\
**Category:** SLED Configure-Administer\
**Created:** [October 16, 2014, 6:07pm UTC](https://forums.suse.com/t/vmware-player-5-kernel-module/26216 "2014-10-16T18:07:09Z")\
**Posts on this page:** 5\
**Page:** 2

<div class="post-metadata">

**Author:** ![mauriB](https://avatars.discourse-cdn.com/v4/letter/m/8e7dd6/32.png) [@mauriB](https://forums.suse.com/u/mauriB)\
**Post date:** [October 23, 2014, 10:42am UTC](https://forums.suse.com/t/vmware-player-5-kernel-module/26216/21 "2014-10-23T10:42:04Z")

</div>

Good morning Mike,

I didn’t try the manually configuration yet,but this morning I removed and installed again the VMware 6 and I seen this message:

` sh VMware-Player-6.0.3-1895310.i386.bundle
Extracting VMware Installer...done.
Gtk-Message: Failed to load module "canberra-gtk-module": libcanberra-gtk-module.so: cannot open shared object file: No such file or directory
Gtk-Message: Failed to load module "gnomebreakpad": libgnomebreakpad.so: cannot open shared object file: No such file or directory
`

In any case the install procedure go ahead without other errors and finish successfully. Futhermore I have installed the kernel update so my SLED now running with the 3.0.101-0.40-pae version but still the modules aren’t loaded.

How can I try to install all the modules via commad-line instead the GUI?

---

<div class="post-metadata">

**Author:** ![mikewillis](https://avatars.discourse-cdn.com/v4/letter/m/b2d939/32.png) [@mikewillis](https://forums.suse.com/u/mikewillis)\
**Post date:** [October 23, 2014, 12:31pm UTC](https://forums.suse.com/t/vmware-player-5-kernel-module/26216/22 "2014-10-23T12:31:33Z")

</div>

> [@mauriB;24319](#):
>
> I didn’t try the manually configuration yet,but this morning I removed and installed again the VMware 6 and I seen this message:
> 
> ` sh VMware-Player-6.0.3-1895310.i386.bundle
> Extracting VMware Installer...done.
> Gtk-Message: Failed to load module "canberra-gtk-module": libcanberra-gtk-module.so: cannot open shared object file: No such file or directory
> Gtk-Message: Failed to load module "gnomebreakpad": libgnomebreakpad.so: cannot open shared object file: No such file or directory
> `

I get those errors too, they’re non fatal. I’ve seen them before with other things, I worked out why they happened once but I forget the answer now 😉

In any case the install procedure go ahead without other errors and finish successfully. Futhermore I have installed the kernel update so my SLED now running with the 3.0.101-0.40-pae version but still the modules aren’t loaded.

[QUOTE=mauriB;24319]  
How can I try to install all the modules via commad-line instead the GUI?[/QUOTE]

`
$ vmware-modconfig --console --install-all`

---

<div class="post-metadata">

**Author:** ![mauriB](https://avatars.discourse-cdn.com/v4/letter/m/8e7dd6/32.png) [@mauriB](https://forums.suse.com/u/mauriB)\
**Post date:** [October 23, 2014, 2:35pm UTC](https://forums.suse.com/t/vmware-player-5-kernel-module/26216/23 "2014-10-23T14:35:10Z")

</div>

Hi Mike,

I have tried to run your command “vmware-modconfig --console --install-all” and here is the output:

`Stopping VMware services:
   VMware Authentication Daemon done
   VM communication interface socket family done
   Virtual machine communication interface done
   Virtual machine monitor done
   Blocking file system done
Using 2.6.x kernel build system.
make: Entering directory `/tmp/modconfig-cAAJUE/vmmon-only'
/usr/bin/make -C /lib/modules/3.0.101-0.40-pae/build/include/.. SUBDIRS=$PWD SRCROOT=$PWD/. \\
	  MODULEBUILDDIR= modules
make[1]: Entering directory `/usr/src/linux-3.0.101-0.40-obj/i386/pae'
/usr/bin/make -C ../../../linux-3.0.101-0.40 O=/usr/src/linux-3.0.101-0.40-obj/i386/pae/. modules
/usr/src/linux-3.0.101-0.40/scripts/gcc-version.sh: line 25: gcc: command not found
/usr/src/linux-3.0.101-0.40/scripts/gcc-version.sh: line 26: gcc: command not found
make[3]: gcc: Command not found
make[4]: gcc: Command not found
  CC [M] /tmp/modconfig-cAAJUE/vmmon-only/linux/driver.o
/bin/sh: gcc: command not found
make[4]: CC [M] /tmp/modconfig-cAAJUE/vmmon-only/linux/driverLog.o
*** [/tmp/modconfig-cAAJUE/vmmon-only/linux/driver.o] Error 127
make[4]: *** Waiting for unfinished jobs....
/bin/sh: gcc: command not found
make[4]: *** [/tmp/modconfig-cAAJUE/vmmon-only/linux/driverLog.o] Error 127
make[3]: *** [_module_/tmp/modconfig-cAAJUE/vmmon-only] Error 2
make[2]: *** [sub-make] Error 2
make[1]: *** [all] Error 2
make[1]: Leaving directory `/usr/src/linux-3.0.101-0.40-obj/i386/pae'
make: *** [vmmon.ko] Error 2
make: Leaving directory `/tmp/modconfig-cAAJUE/vmmon-only'
Using 2.6.x kernel build system.
make: Entering directory `/tmp/modconfig-cAAJUE/vmnet-only'
/usr/bin/make -C /lib/modules/3.0.101-0.40-pae/build/include/.. SUBDIRS=$PWD SRCROOT=$PWD/. \\
	  MODULEBUILDDIR= modules
make[1]: Entering directory `/usr/src/linux-3.0.101-0.40-obj/i386/pae'
/usr/bin/make -C ../../../linux-3.0.101-0.40 O=/usr/src/linux-3.0.101-0.40-obj/i386/pae/. modules
/usr/src/linux-3.0.101-0.40/scripts/gcc-version.sh: line 25: gcc: command not found
/usr/src/linux-3.0.101-0.40/scripts/gcc-version.sh: line 26: gcc: command not found
make[3]: gcc: Command not found
make[4]: gcc: Command not found
  CC [M] /tmp/modconfig-cAAJUE/vmnet-only/driver.o
/bin/sh: gcc: command not found
  CC [M] /tmp/modconfig-cAAJUE/vmnet-only/hub.o
/bin/sh: gcc: command not found
make[4]: *** [/tmp/modconfig-cAAJUE/vmnet-only/driver.o] Error 127
make[4]: *** Waiting for unfinished jobs....
make[4]: *** [/tmp/modconfig-cAAJUE/vmnet-only/hub.o] Error 127
  CC [M] /tmp/modconfig-cAAJUE/vmnet-only/userif.o
/bin/sh: gcc: command not found
make[4]: *** [/tmp/modconfig-cAAJUE/vmnet-only/userif.o] Error 127
make[3]: *** [_module_/tmp/modconfig-cAAJUE/vmnet-only] Error 2
make[2]: *** [sub-make] Error 2
make[1]: *** [all] Error 2
make[1]: Leaving directory `/usr/src/linux-3.0.101-0.40-obj/i386/pae'
make: *** [vmnet.ko] Error 2
make: Leaving directory `/tmp/modconfig-cAAJUE/vmnet-only'
Using 2.6.x kernel build system.
make: Entering directory `/tmp/modconfig-cAAJUE/vmci-only'
/usr/bin/make -C /lib/modules/3.0.101-0.40-pae/build/include/.. SUBDIRS=$PWD SRCROOT=$PWD/. \\
	  MODULEBUILDDIR= modules
make[1]: Entering directory `/usr/src/linux-3.0.101-0.40-obj/i386/pae'
/usr/bin/make -C ../../../linux-3.0.101-0.40 O=/usr/src/linux-3.0.101-0.40-obj/i386/pae/. modules
/usr/src/linux-3.0.101-0.40/scripts/gcc-version.sh: line 25: gcc: command not found
/usr/src/linux-3.0.101-0.40/scripts/gcc-version.sh: line 26: gcc: command not found
make[3]: gcc: Command not found
make[4]: gcc: Command not found
  CC [M] /tmp/modconfig-cAAJUE/vmci-only/linux/driver.o
/bin/sh: gcc: command not found
  CC [M] /tmp/modconfig-cAAJUE/vmci-only/linux/vmciKernelIf.o
/bin/sh: gcc: command not found
make[4]: *** [/tmp/modconfig-cAAJUE/vmci-only/linux/driver.o] Error 127
make[4]: *** Waiting for unfinished jobs....
make[4]: *** [/tmp/modconfig-cAAJUE/vmci-only/linux/vmciKernelIf.o] Error 127
  CC [M] /tmp/modconfig-cAAJUE/vmci-only/common/vmciContext.o
/bin/sh: gcc: command not found
make[4]: *** [/tmp/modconfig-cAAJUE/vmci-only/common/vmciContext.o] Error 127
make[3]: *** [_module_/tmp/modconfig-cAAJUE/vmci-only] Error 2
make[2]: *** [sub-make] Error 2
make[1]: *** [all] Error 2
make[1]: Leaving directory `/usr/src/linux-3.0.101-0.40-obj/i386/pae'
make: *** [vmci.ko] Error 2
make: Leaving directory `/tmp/modconfig-cAAJUE/vmci-only'
Unable to install all modules. See log for details.
`

In the early lines I have seen this error:

“make[3]: gcc: Command not found”

Actually I didn’t have the gcc compiler , I had only the gcc43 compiler! So i installed the gcc, gcc-c++ packages and the installation finally work!!! : )

---

<div class="post-metadata">

**Author:** ![mikewillis](https://avatars.discourse-cdn.com/v4/letter/m/b2d939/32.png) [@mikewillis](https://forums.suse.com/u/mikewillis)\
**Post date:** [October 23, 2014, 3:16pm UTC](https://forums.suse.com/t/vmware-player-5-kernel-module/26216/24 "2014-10-23T15:16:47Z")

</div>

[QUOTE=mauriB;24335]  
Actually I didn’t have the gcc compiler , I had only the gcc43 compiler! So i installed the gcc, gcc-c++ packages and the installation finally work!!! : )[/QUOTE]

Curious. Earlier output you posted indicated that /usr/bin/gcc-4.3 had been found so I’d assumed that was being used. /usr/bin/gcc is in the gcc package. Also curious given that on a fresh install of SLED 11 SP3 I didn’t have to install the gcc package specifically, which indicates it should either be installed as a dependency of one of the three packages I did have to install I mentioned in earlier post, or by default. Oh well, glad you got it sorted.

---

<div class="post-metadata">

**Author:** ![mauriB](https://avatars.discourse-cdn.com/v4/letter/m/8e7dd6/32.png) [@mauriB](https://forums.suse.com/u/mauriB)\
**Post date:** [October 23, 2014, 4:53pm UTC](https://forums.suse.com/t/vmware-player-5-kernel-module/26216/25 "2014-10-23T16:53:27Z")

</div>

I have installed a VM and it works too : ) thank you a lot for your support!!!. I have to say that without your help I would not have been able to solve the issue. 🙂

[Previous page](https://forums.suse.com/t/vmware-player-5-kernel-module/26216.md?page=1)
